{"text_format":"1","workbook":"xlsx","n_sheets":3,"sheets":["Estimator","Working data","Prior Allowances"],"not_rendered":{"charts":0,"images":0,"macros":1,"external_links":0,"defined_names":2,"comments":4,"pivot_tables":0},"unopened":[],"bounds":{"document_bytes":16777216,"sheet_cells":100000,"rows_first":2000,"rows_last":500,"rows_between":2000,"halvings":0,"cell_chars":16384,"cell_head_chars":4096},"cells_cut":0,"cells_raw":0,"read":"whole","date_system":"1900"}

{"sheet":"Estimator","index":0,"n_rows":51,"n_cols":16,"rows_kept":51,"cut":false,"hidden":false,"merged":[[1,2,2,11],[17,5,18,9],[14,5,15,9]]}
[]
[null,null,"Additional Pay Allowances Estimator based on the new Pay and Reward Role Profiles"]
[]
[]
[]
[null,null,"Guidance Notes",null,null,null,"Usage notes"]
[null,null,"1. It is best to reset between evaluations to ensure correct salary.",null,null,null,"1. Click on the orange Band box and select from the list"]
[null,null,"2. Please refer to the additional pay allowances policy for guidance.",null,null,null,"2. Select the required SCP from the orange drop down list, only SCP's "]
[null,null,"3. To use the calculator the salary Band is required.",null,null,null,"applicable to the pay band are displayed."]
[null,null,"4. Orange cells are drop down lists to select from, start by selecting the required Band.",null,null,null,"3 If you have a salary supplement enter the ANNUAL amount in the box."]
[null,null,"5. White cells should be populated with hours/frequency as appropriate",null,null,null,"4. Complete the white frequency/hours boxes for applicable additional "]
[null,null,"6. Purple cells are automatic calculation cells or not required cells.",null,null,null,"pay allowances."]
[]
[]
[null,null,null,null,null,"Resets the whole calculator"]
[]
[]
[null,null,null,null,null,"Reset Band between valuations by clicking this button"]
[]
[]
[]
[null,null,"Band - select from drop down list",null,"No additional pay allowances are payable for Band 12 and above",null,null,null,null,null,null,null,null,null,null,{"$f":"IFERROR(VLOOKUP(#REF!,'Working data'!M2:X618,8,FALSE),\" \")","v":" "}]
[null,null,"SCP - select from drop down list"]
[null,null,"Salary Supplement - enter ANNUAL amount"]
[]
[null,null,"Annual Salary - inclusive of supplement",null,null,null,{"$f":"IFERROR(IF(D23=\"-\",0,(VLOOKUP(D23,'Working data'!AG4:AH46,2,FALSE)+D24)),0)","v":0},"Have you updated the SCP selection"]
[]
[null,null,"Additional Pay Allowance","Total hours per annum","Number of times per annum","Number of payments per annum","Total payment"]
[null,null,null,null,null,null,"£"]
[null,null,"Overtime - over 37hrs",null,null,null,{"$f":"IFERROR((('Working data'!AH2*'Working data'!AL3)*D30),0)","v":0},"Hours in excess of  37 hours"]
[null,null,"Overtime - BH over 37 hrs",null,null,null,{"$f":"IFERROR((('Working data'!AH2*'Working data'!AL4)*D31),0)","v":0},"Bank Holiday hours in excess of 37 hours"]
[null,null,"Overtime - Nightwork over 37hrs",null,null,null,{"$f":"IFERROR((('Working data'!AH2*'Working data'!AL5)*D32),0)","v":0},"Nightwork (8pm to 6am) hours in excess of 37 hours"]
[]
[null,null,"Bank Holiday - less than 37 hours",null,null,null,{"$f":"IFERROR((('Working data'!AH2*'Working data'!AL14)*D34),0)","v":0},"Bank Holiday hours less than 37 hours"]
[]
[null,null,"Nightwork - not over 37 hrs",null,null,null,{"$f":"IFERROR((('Working data'!AH2*'Working data'!AL6)*D36),0)","v":0},"Work between the hours of 8pm and 6am as part of the working week"]
[]
[null,null,"Sleep in hours",null,null,null,{"$f":"(D38*'Working data'!AL7)","v":0}]
[]
[null,null,"Call out - over 37 hrs",null,null,null,{"$f":"IFERROR(((('Working data'!AH2*'Working data'!AL8)*D40)),0)","v":0},"Hours in excess of  37 hours"]
{"$rows_left_out":12}
{"sheet":"Working data","index":1,"n_rows":632,"n_cols":41,"rows_kept":632,"cut":false,"hidden":true,"merged":[]}
["ROLE PROFILE REF","ROLE PROFILE NAME","CLUSTER","JOB FAMILY","DEPARTMENT","JOB SIZE","REF LEVEL INC AWES","Band","Min SCP","Max SCP",null,null,"Grade",null,null,null,null,null,null,null,null,null,null,"Grade","MIN","MAX","Min SCP","Max SCP","Grade",null,null,null,null,"2025/26",null,null,"Rates"]
["ACI001","COMMISSIONING MANAGER","COMMISSIONING","COMMISSIONING","ADULT SOCIAL CARE COMMISSIONING",498,17,12,41,46,null,null,{"$f":"Estimator!D22","v":0},{"$f":"VLOOKUP($M$2,$M$3:$V$29,2,FALSE)","v":{"$error":"#N/A"}},{"$f":"VLOOKUP($M$2,$M$3:$V$13,3,FALSE)","v":{"$error":"#N/A"}},{"$f":"VLOOKUP($M$2,$M$3:$V$13,4,FALSE)","v":{"$error":"#N/A"}},{"$f":"VLOOKUP($M$2,$M$3:$V$13,5,FALSE)","v":{"$error":"#N/A"}},{"$f":"VLOOKUP($M$2,$M$3:$V$13,6,FALSE)","v":{"$error":"#N/A"}},{"$f":"VLOOKUP($M$2,$M$3:$V$13,7,FALSE)","v":{"$error":"#N/A"}},{"$f":"VLOOKUP($M$2,$M$3:$V$13,8,FALSE)","v":{"$error":"#N/A"}},{"$f":"VLOOKUP($M$2,$M$3:$V$13,9,FALSE)","v":{"$error":"#N/A"}},{"$f":"VLOOKUP($M$2,$M$3:$V$13,10,FALSE)","v":{"$error":"#N/A"}},null,"Band A4",{"$f":"VLOOKUP(AA2,$AG$4:$AH$47,2,FALSE)","v":{"$error":"#N/A"}},{"$f":"VLOOKUP(AB2,$AG$4:$AH$47,2,FALSE)","v":25989},4,6,"Band 1",null,null,null,"Hourly rate",{"$f":"(VLOOKUP(Estimator!D23,AG4:AH45,2,FALSE)+Estimator!D24)/37/52.1429","v":{"$error":"#N/A"}}]
["ACI002","COMMISSIONING TEAM LEADER","COMMISSIONING","COMMISSIONING","ADULT SOCIAL CARE COMMISSIONING",355,15,10,32,38,null,null,1,"RLW",5,{"$f":"O3+1","v":6},"-","-","-","-","-","-",null,"Band B5",{"$f":"VLOOKUP(AA3,$AG$4:$AH$47,2,FALSE)","v":{"$error":"#N/A"}},{"$f":"VLOOKUP(AB3,$AG$4:$AH$47,2,FALSE)","v":25989},4,6,"Band 1",null,null,null,"SCP","Estimate",null,null,"Overtime - over 37hrs",1.5]
["ACI003","COMMISSIONING OFFICER II","COMMISSIONING","COMMISSIONING","ADULT SOCIAL CARE COMMISSIONING",293,14,9,27,35,null,null,2,"RLW",5,6,7,8,"-","-","-","-",null,"Band C6",{"$error":"#N/A"},25989,4,6,"Band 1",null,null,null,1,null,null,null,"Overtime - BH over 37 hrs",2]
["ACI004","COMMISSIONING OFFICER I ","COMMISSIONING","COMMISSIONING","ADULT SOCIAL CARE COMMISSIONING",242,13,8,22,28,null,null,3,7,{"$f":"N5+1","v":8},9,{"$f":"P5+1","v":10},{"$f":"Q5+1","v":11},"-","-","-","-",null,"Band D7",{"$error":"#N/A"},26824,4,8,"Band 2",null,null,null,2,null,null,null,"Overtime - Nightwork over 37hrs",1.5]
["ACI007","PRINCIPAL OCCUPATIONAL THERAPIST","OCCUPATIONAL THERAPY","SOCIAL CARE","ADULT SOCIAL CARE COMMISSIONING",551,18,13,46,50,null,null,4,9,{"$f":"N6+1","v":10},11,{"$f":"P6+1","v":12},{"$f":"Q6+1","v":13},{"$f":"R6+1","v":14},"-","-","-",null,"Band E8",26403,28142,7,11,"Band 3",null,null,null,3,null,null,null,"Nightwork - not over 37 hrs",0.33]
["ASC001","OCCUPATIONAL THERAPY ASSISTANT I","OCCUPATIONAL THERAPY","SOCIAL CARE","ADULT SOCIAL CARE",219,12,7,18,25,null,null,5,11,12,13,14,15,16,{"$f":"S7+1","v":17},{"$f":"T7+1","v":18},"-",null,"Band F9",{"$f":"VLOOKUP(AA7,$AG$4:$AH$47,2,FALSE)","v":27254},{"$f":"VLOOKUP(AB7,$AG$4:$AH$47,2,FALSE)","v":29540},9,14,"Band 4",null,null,null,"RLW",24309,"RLW",null,"Sleep in hours",12.21,null,"Assumed 23+","NLW"]
["ASC002","OCCUPATIONAL THERAPIST I","OCCUPATIONAL THERAPY","SOCIAL CARE","ADULT SOCIAL CARE",302,14,9,27,35,null,null,6,15,{"$f":"N8+1","v":16},{"$f":"O8+1","v":17},18,19,20,{"$f":"S8+1","v":21},"-","-",null,"Band G10",28142,31537,11,18,"Band 5",null,null,null,5,25583,null,null,"Call out - over 37hrs",1.5]
["ASC003","OCCUPATIONAL THERAPIST II","OCCUPATIONAL THERAPY","SOCIAL CARE","ADULT SOCIAL CARE",364,15,10,32,38,null,null,7,18,{"$f":"N9+1","v":19},{"$f":"O9+1","v":20},21,22,23,{"$f":"S9+1","v":24},{"$f":"T9+1","v":25},"-",null,"Band H11",30024,33143,15,21,"Band 6",null,null,null,6,25989,null,null,"Call out - nightwork over 37 hrs",1.5]
["ASC004","OCCUPATIONAL THERAPIST III","OCCUPATIONAL THERAPY","SOCIAL CARE","ADULT SOCIAL CARE",417,16,11,36,42,null,null,8,22,{"$f":"N10+1","v":23},24,25,26,27,{"$f":"S10+1","v":28},"-","-",null,"Band I12",31537,36363,18,25,"Band 7",null,null,null,7,26403,null,null,"Call out - nightwork not over 37hrs",0.5]
["ASC005","CARER SUPPORT WORKER","ADULTS IN-HOUSE","SOCIAL CARE","ADULT SOCIAL CARE",161,11,6,15,21,null,null,9,27,{"$f":"N11+1","v":28},29,30,31,32,{"$f":"S11+1","v":33},{"$f":"T11+1","v":34},{"$f":"U11+1","v":35},null,"Band J13",33699,39152,22,28,"Band 8",null,null,null,8,26824,null,null,"Standby - Type 1",153.02000000000001,null,148.27000000000001,{"$f":"AN11*1.032","v":153.01464000000001}]
["ASC006","CARER SUPPORT WORKER","CARER SUPPORT","SOCIAL CARE","ADULT SOCIAL CARE",175,11,6,15,21,null,null,10,32,{"$f":"N12+1","v":33},34,35,36,37,{"$f":"S12+1","v":38},"-","-",null,"Band K14",38220,46142,27,35,"Band 9",null,null,null,9,27254,null,null,"Standby - Type 2",82.42,null,79.86,{"$f":"AN12*1.032","v":82.415520000000001}]
["ASC007","REABLEMENT ASSISTANT","ADULTS IN-HOUSE","SOCIAL CARE","ADULT SOCIAL CARE",161,11,6,15,21,null,null,11,36,{"$f":"N13+1","v":37},38,39,40,41,42,"-","-",null,"Band L15",42839,49282,32,38,"Band 10",null,null,null,10,27694,null,null,"Tool Allowance",31.26]
["ASC008","CARER SUPPORT MANAGER","CARER SUPPORT","SOCIAL CARE","ADULT SOCIAL CARE",293,14,9,27,35,null,null,12,"-","-","-","-","-","-","-","-","-",null,"Band M16",47181,53460,36,42,"Band 11",null,null,null,11,28142,null,null,"Bank Holiday less than 37 hrs",1]
["ASC009","SOCIAL CARE FINANCIAL ASSESSMENT OFFICER","SCHOOLS","SOCIAL CARE","ADULT SOCIAL CARE",178,11,6,15,21,null,null,{"$f":"M14+1","v":13},"-","-","-","-","-","-","-","-","-",null,null,null,null,null,null,null,null,null,null,12,28598]
["ASC010","SOCIAL CARE FINANCE MANAGER","SCHOOLS","SOCIAL CARE","ADULT SOCIAL CARE",406,16,11,36,42,null,null,{"$f":"M15+1","v":14},"-","-","-","-","-","-","-","-","-",null,null,null,null,null,null,null,null,null,null,13,29064]
["ASC011","SUPPORT TIME RECOVERY WORKER I","ADULTS","SOCIAL CARE","ADULT SOCIAL CARE",150,10,5,11,18,null,null,15,"-","-","-","-","-","-","-","-","-",null,null,null,null,null,null,null,null,null,null,14,29540]
["ASC012","SUPPORT TIME RECOVERY WORKER II","ADULTS","SOCIAL CARE","ADULT SOCIAL CARE",258,13,8,22,28,null,null,16,"-","-","-","-","-","-","-","-","-",null,null,null,null,null,null,null,null,null,null,15,30024]
["ASC013","OCCUPATIONAL THERAPY ASSISTANT II","OCCUPATIONAL THERAPY","SOCIAL CARE","ADULT SOCIAL CARE",251,13,8,22,28,null,null,17,"-","-","-","-","-","-","-","-","-",null,null,null,null,null,null,null,null,null,null,16,30518]
["ASC014","DEPUTYSHIP OFFICER","ADULTS","SOCIAL CARE","ADULT SOCIAL CARE",252,13,8,22,28,null,null,18,"-","-","-","-","-","-","-","-","-",null,null,null,null,null,null,null,null,null,null,17,31022]
["ASC015","DIRECT PAYMENTS OFFICER","SCHOOLS","SOCIAL CARE","ADULT SOCIAL CARE",173,11,6,15,21,null,null,19,"-","-","-","-","-","-","-","-","-",null,null,null,null,null,null,null,null,null,null,18,31537]
["ASC016","REGISTERED MANAGER","ADULTS IN-HOUSE","SOCIAL CARE","ADULT SOCIAL CARE",406,16,11,36,42,null,null,20,"-","-","-","-","-","-","-","-","-",null,null,null,null,null,null,null,null,null,null,19,32061]
["ASC018","TRAINING CO-ORDINATOR","L&D","HR & WORKFORCE DEVELOPMENT","ADULT SOCIAL CARE",291,14,9,27,35,null,null,21,"-","-","-","-","-","-","-","-","-",null,null,null,null,null,null,null,null,null,null,20,32597]
["ASC019","DOLS ADMINISTRATOR","ADULTS","SOCIAL CARE","ADULT SOCIAL CARE",203,12,7,18,25,null,null,22,"-","-","-","-","-","-","-","-","-",null,null,null,null,null,null,null,null,null,null,21,33143]
["ASC020","DOLS ADMINISTRATION MANAGER","ADULTS","SOCIAL CARE","ADULT SOCIAL CARE",282,14,9,27,35,null,null,23,"-","-","-","-","-","-","-","-","-",null,null,null,null,null,null,null,null,null,null,22,33699]
["ASC022","DEPUTYSHIP MANAGER","ADULTS","SOCIAL CARE","ADULT SOCIAL CARE",406,16,11,36,42,null,null,24,"-","-","-","-","-","-","-","-","-",null,null,null,null,null,null,null,null,null,null,23,34434]
["ASC024","SHARED LIVES MANAGER","ADULTS IN-HOUSE","SOCIAL CARE","ADULT SOCIAL CARE",353,15,10,32,38,null,null,25,"-","-","-","-","-","-","-","-","-",null,null,null,null,null,null,null,null,null,null,24,35412]
["ASC025","SUPPORT & REABLEMENT OFFICER","ADULTS IN-HOUSE","SOCIAL CARE","ADULT SOCIAL CARE",248,13,8,22,28,null,null,26,"-","-","-","-","-","-","-","-","-",null,null,null,null,null,null,null,null,null,null,25,36363]
["ASC026","SHARED LIVES OFFICER","ADULTS IN-HOUSE","SOCIAL CARE","ADULT SOCIAL CARE",240,13,8,22,28,null,null,27,"-","-","-","-","-","-","-","-","-",null,null,null,null,null,null,null,null,null,null,26,37280]
["ASC028","COMMUNITY SUPPORT WORKER","ADULTS","SOCIAL CARE","ADULT SOCIAL CARE",153,10,5,11,18,null,null,null,null,null,null,null,null,null,null,null,null,null,null,null,null,null,null,null,null,null,null,27,38220]
["ASC029","CARE SUPPORT ASSISTANT","ADULTS IN-HOUSE","SOCIAL CARE","ADULT SOCIAL CARE",124,9,4,9,14,null,null,null,null,null,null,null,null,null,null,null,null,null,null,null,null,null,null,null,null,null,null,28,39152]
["ASC030","CONTINUING HEALTH CARE CO-ORDINATOR","ADULTS","SOCIAL CARE","ADULT SOCIAL CARE",240,13,8,22,28,null,null,null,null,null,null,null,null,null,null,null,null,null,null,null,null,null,null,null,null,null,null,29,39862]
["ASC031","REHABILITATION OFFICER  - VISUAL IMPAIRMENT","ADULTS","SOCIAL CARE","ADULT SOCIAL CARE",313,14,9,27,35,null,null,null,null,null,null,null,null,null,null,null,null,null,null,null,null,null,null,null,null,null,null,30,40777]
["ASC032","CASE SUPPORT CO-ORDINATOR","ADULTS","SOCIAL CARE","ADULT SOCIAL CARE",202,12,7,18,25,null,null,null,null,null,null,null,null,null,null,null,null,null,null,null,null,null,null,null,null,null,null,31,41771]
["COM001","PEST CONTROL OPERATIVE","COMMUNITIES","COMMUNITIES","COMMUNITIES",150,10,5,11,18,null,null,null,null,null,null,null,null,null,null,null,null,null,null,null,null,null,null,null,null,null,null,32,42839]
["COM002","EH / TS TECHNICIAN ","EH / TS","COMMUNITIES","COMMUNITIES",182,11,6,15,21,null,null,null,null,null,null,null,null,null,null,null,null,null,null,null,null,null,null,null,null,null,null,33,44075]
["COM003","EH / TS OFFICER","EH / TS","COMMUNITIES","COMMUNITIES",310,14,9,27,35,null,null,null,null,null,null,null,null,null,null,null,null,null,null,null,null,null,null,null,null,null,null,34,45091]
["COM004","EH / TS TECHNICAL OFFICER","EH / TS","COMMUNITIES","COMMUNITIES",249,13,8,22,28,null,null,null,null,null,null,null,null,null,null,null,null,null,null,null,null,null,null,null,null,null,null,35,46142]
["COM005","COMMUNITY SAFETY OFFICER","COMMUNITIES","COMMUNITIES","COMMUNITIES",183,11,6,15,21,null,null,null,null,null,null,null,null,null,null,null,null,null,null,null,null,null,null,null,null,null,null,36,47181]
["COM006","CCTV OPERATOR I","COMMUNITIES","COMMUNITIES","COMMUNITIES",133,9,4,9,14,null,null,null,null,null,null,null,null,null,null,null,null,null,null,null,null,null,null,null,null,null,null,37,48226]
{"$rows_left_out":593}
{"sheet":"Prior Allowances","index":2,"n_rows":591,"n_cols":55,"rows_kept":591,"cut":false,"hidden":true,"merged":[]}
[1,{"$f":"A1+1","v":2},{"$f":"B1+1","v":3},4,5,6,7,8,9,10,11,12,13,14,15,16,17,18,19,20,21,22,23,24,25,26,27,28,29,30,31,32,33,34,35,36,37,38,39,40,41,42,43,44,45,46,47,48,49,50,51,52,53,54,55]
[]
["Ref","ROLE PROFILE NAME","CLUSTER","JOB FAMILY","DEPARTMENT","D&BKH","P&O","C&I","KH POINTS","TE","TC","PS %","PS POINTS","FTA","MAG","IMP","ACC POINTS","PROFILE","TOTAL POINTS","REF LEVEL EXC AWES","PHYSICAL",null,"ENVIRONMENTAL",null,"MENTAL",null,"EMOTIONAL",null,"JOB SIZE","REF LEVEL INC AWES",null,"Total Number of Employees",null,"Overtime","Bank holiday working","Callout","Standby","Night work","Sleep in","Shift work","Unsociable hours","Split shift","Weekend working","Out of hours officer payment","Duty payment","First aid allowance","Fire Warden allowance","Nursery nurse allowance","School lettings","Swimming pool allowance","Tool allowance","Telephone rental","Total Allowances","FTE's per post","Average per FTE"]
["MUL124","CLEANER I","FACILITIES","FACILITIES","MULTIPLE","A","T",1,43,"A","1+",0.12,5,"A","N","I",8,"A3",56,"4","C-",3,"C-",3,"A+",1,"A",0,63,5,null,12,null,57,0,178.5,103.02,0,0,0,0,0,0,0,0,0,0,0,0,0,0,0,338.52,10.698748471371257,31.641084086222275]
["SCH006","MIDDAY SUPERVISOR I","SCHOOLS","EDUCATION","SCHOOLS","A+","T",1,50,"A","1+",0.12,6,"A","N","I+",10,"A4",66,"5","B",2,"B",2,"A",0,"A+",1,71,5,null,0,null,0,0,0,0,0,0,0,0,0,0,0,0,0,0,0,0,0,0,0,0,11.053001793508122,0]
["GRO008","SCHOOL CROSSING PATROL","ROAD SAFETY","TRANSPORT","GROWTH & INFRASTRUCTURE","A","T+",1,50,"A","1+",0.12,6,"A","N","I",9,"A3",65,"5","B+",3,"B+",3,"B",2,"A+",1,74,6,null,34,null,305.43,0,0,0,0,0,0,0,0,0,0,0,0,0,0,0,0,0,0,305.43,7.6185986097720271,40.09005010557177]
["MUL165","INTERMEDIATE APPRENTICE - IT / TECHNICAL","APPRENTICE","APPRENTICE","MULTIPLE","B","T",1,57,"B","1+",0.14000000000000001,8,"A+","N","II-",12,"A3",77,"6","A",0,"A",0,"A",0,"A",0,77,6,null,0,null,0,0,0,0,0,0,0,0,0,0,0,0,0,0,0,0,0,0,0,0,0,0]
["MUL163","INTERMEDIATE APPRENTICE - BUSINESS ADMINISTRATION / CUSTOMER SERVICE","APPRENTICE","APPRENTICE","MULTIPLE","B","T",1,57,"B","1+",0.14000000000000001,8,"A+","N","II-",12,"A3",77,"6","A",0,"A",0,"A",0,"B",2,79,6,null,0,null,0,0,0,0,0,0,0,0,0,0,0,0,0,0,0,0,0,0,0,0,0,0]
["SCH017","ASSISTANT CARETAKER","FACILITIES","FACILITIES","SCHOOLS","B","T",1,57,"A+","1+",0.12,7,"A+","N","I+",10,"A3",74,"6","C-",3,"C-",3,"A+",1,"A",0,81,6,null,0,null,0,0,0,0,0,0,0,0,0,0,0,0,0,0,0,0,0,0,0,0,1,0]
["SCH016","CLEANER IN CHARGE","FACILITIES","FACILITIES","SCHOOLS","B-","T+",1,57,"A+","1+",0.12,7,"A+","N","I+",10,"A3",74,"6","C-",3,"C-",3,"A+",1,"A",0,81,6,null,0,null,0,0,0,0,0,0,0,0,0,0,0,0,0,0,0,0,0,0,0,0,0.26821758467328088,0]
["MUL104","CATERING ASSISTANT I","CATERING","CATERING","MULTIPLE","B","T",1,57,"B","1+",0.14000000000000001,8,"B","N","I",12,"A3",77,"6","B+",3,"B-",1,"A",0,"A+",1,82,6,null,15,null,0,890.56,0,0,0,0,0,0,0,0,0,0,0,0,0,0,0,0,0,890.56,1.5541108108108106,573.03507176259654]
["MUL164","INTERMEDIATE APPRENTICE - CRAFT / TRADE / OPERATIVE","APPRENTICE","APPRENTICE","MULTIPLE","B","T",1,57,"B","1+",0.14000000000000001,8,"A+","N","II-",12,"A3",77,"6","B",2,"B",2,"B",2,"A",0,83,6,null,0,null,0,0,0,0,0,0,0,0,0,0,0,0,0,0,0,0,0,0,0,0,0,0]
["MUL111","KITCHEN ASSISTANT","CATERING","CATERING","MULTIPLE","B","T",1,57,"B","1+",0.14000000000000001,8,"B","N","I",12,"A3",77,"6","B+",3,"C-",3,"B-",1,"A",0,84,6,null,0,null,0,0,0,0,0,0,0,0,0,0,0,0,0,0,0,0,0,0,0,0,3.0381820255237981,0]
["CUL032","LEISURE GENERAL ASSISTANT","LEISURE","LEISURE","DESTINATION & CULTURE","B","T",1,57,"B","1+",0.14000000000000001,8,"A+","N","II-",12,"A3",77,"6","B+",3,"B+",3,"A+",1,"A",0,84,6,null,7,null,2911.8199999999997,0,0,0,0,0,0,0,0,0,0,0,0,0,0,0,0,0,0,2911.8199999999997,3.8242864864864869,761.4021622828775]
["GRO007","PASSENGER ASSISTANT","PASSENGER TRANSPORT","TRANSPORT","GROWTH & INFRASTRUCTURE","B","T",1,57,"B","1+",0.14000000000000001,8,"A+","N","II",14,"A4",79,"6","B",2,"B",2,"A+",1,"A+",1,85,7,null,129,null,172059.89000000007,0,0,0,0,0,0,0,865.32000000000016,0,0,0,0,0,0,0,0,0,0,172925.21000000008,48.254659616002634,3583.5960998604392]
["CUL005","SEAFRONT GENERAL ASSISTANT","SCHOOLS","ENVIRONMENT","DESTINATION & CULTURE","B","T",1,57,"B","1+",0.14000000000000001,8,"A+","N","II-",12,"A3",77,"6","B+",3,"B+",3,"B",2,"B",2,87,7,null,7,null,0,0,0,0,0,0,0,0,0,0,0,0,0,0,0,0,0,0,0,0,6.3108108108108105,0]
["MUL182","CLEANER II","MULTIPLE","FACILITIES","MULTIPLE","B","T",1,57,"B",2,0.14000000000000001,9,"B","N","11-",16,"A4",82,"6","C-",3,"C-",3,"A+",1,"A",0,89,7,null,2,null,229.43,0,0,0,0,0,0,0,0,0,0,0,0,0,0,0,0,0,0,229.43,1.6148659036481821,142.07371614057195]
["MUL044","CUSTOMER FACING ADMINISTRATION ASSISTANT I","CUSTOMER FACING ADMIN","BUSINESS SUPPORT & ADMINISTRATION","MULTIPLE","B+","T",1,66,"B","1+",0.14000000000000001,9,"A+","N","II",12,"A2",87,"7","A",0,"A",0,"A",0,"B",2,89,7,null,2,null,0,0,0,0,0,0,0,0,0,0,0,0,0,0,0,0,0,0,0,0,3.4888190837557929,0]
["CUL004","COACH / INSTRUCTOR IV","COACH / INSTRUCTOR","LEISURE","DESTINATION & CULTURE","B","T+",1,66,"B","1+",0.14000000000000001,9,"A+","N","II-",12,"A2",87,"7","C",4,"B",2,"A",0,"A",0,93,7,null,1,null,0,0,0,0,0,0,0,0,0,0,0,0,0,0,0,0,0,0,0,0,5.4100000000000002E-2,0]
["MUL125","COURIER/POST ASSISTANT","FACILITIES","FACILITIES","MULTIPLE","B+","T",1,66,"B","1+",0.14000000000000001,9,"B-","N","II-",16,"A4",91,"7","B",2,"A",0,"B",2,"A",0,95,7,null,5,null,342.84000000000003,0,0,0,0,0,0,0,0,0,0,0,0,0,0,0,0,0,0,342.84000000000003,5,68.568000000000012]
["LGV015","DEPUTY MACE BEARER / CHAUFFEUR","DEMOCRATIC SERVICES","DEMOCRATIC","LAW & GOVERNANCE","B+","T+",1,66,"B",2,0.16,10,"B-","N","II",16,"A3",92,"7","B",2,"A",0,"B-",1,"A",0,95,7,null,0,null,0,0,0,0,0,0,0,0,0,0,0,0,0,0,0,0,0,0,0,0,0,0]
["SCH014","BREAKFAST CLUB SUPERVISOR","SCHOOLS","EDUCATION","SCHOOLS","B","T+",1,66,"B",2,0.16,10,"B-","N","II",16,"A3",92,"7","B",2,"B-",1,"A",0,"A+",1,96,7,null,0,null,0,0,0,0,0,0,0,0,0,0,0,0,0,0,0,0,0,0,0,0,0,0]
["SCH005","MIDDAY SUPERVISOR II","SCHOOLS","EDUCATION","SCHOOLS","B","T+",1,66,"B","1+",0.14000000000000001,9,"B","N","II-",16,"A4",91,"7","B",2,"B",2,"A",0,"A+",1,96,7,null,0,null,0,0,0,0,0,0,0,0,0,0,0,0,0,0,0,0,0,0,0,0,1.0155869333084524,0]
["MUL123","CARETAKER / MAINTENANCE TECHNICIAN","FACILITIES","FACILITIES","MULTIPLE","B+","T+",1,66,"B",2,0.16,10,"A+","N","II",14,"A2",90,"7","C-",3,"C-",3,"A+",1,"A",0,97,7,null,3,null,712.52,0,0,0,0,0,0,0,0,0,0,0,0,0,0,0,0,0,0,712.52,4.4148777874537366,161.39065095411013]
["MUL105","CATERING ASSISTANT II","CATERING","CATERING","MULTIPLE","B+","T",1,66,"B",2,0.16,10,"B","N","II-",16,"A3",92,"7","B+",3,"B-",1,"A",0,"A+",1,97,7,null,7,null,3024.7799999999997,0,0,0,0,0,0,0,0,0,0,0,0,0,0,0,0,0,0,3024.7799999999997,5.8377999999999997,518.13696940628313]
["ENV023","CREMATORIUM ASSISTANT","BEREAVEMENT ","REGISTRATION & BEREAVEMENT","ENVIRONMENT","B+","T+",1,66,"B",2,0.16,10,"B-","N","II",16,"A3",92,"7","B+",3,"B",2,"A+",1,"A+",1,99,8,null,4,null,4707.63,0,0,0,0,0,0,0,0,0,0,0,543.06000000000006,0,0,0,0,0,0,5250.6900000000005,2.7972999999999999,1877.0564472884569]
["CUL031","PATROL BOAT CREW","SCHOOLS","ENVIRONMENT","DESTINATION & CULTURE","B+","T+",1,66,"B",2,0.16,10,"B-","N","II",16,"A3",92,"7","B",2,"B",2,"B",2,"B",2,100,8,null,0,null,0,0,0,0,0,0,0,0,0,0,0,0,0,0,0,0,0,0,0,0,0,0]
["CUL030","LAND TRAIN DRIVER","SCHOOLS","ENVIRONMENT","DESTINATION & CULTURE","B","T+",1,66,"B",2,0.16,10,"B-","N","II",16,"A3",92,"7","B",2,"B",2,"B+",3,"A+",1,100,8,null,1,null,0,0,0,0,0,0,0,0,0,0,0,0,0,0,0,0,0,0,0,0,1,0]
["MUL112","ASSISTANT COOK ","CATERING","CATERING","MULTIPLE","B+","T",1,66,"B",2,0.16,10,"B","N","II-",16,"A3",92,"7","B+",3,"C",4,"B",2,"A",0,101,8,null,3,null,1055.04,0,0,0,0,0,0,0,0,0,0,0,0,0,0,0,0,0,0,1055.04,2.2262,473.91968376605877]
["GRO006","PASSENGER DRIVER ","PASSENGER TRANSPORT","TRANSPORT","GROWTH & INFRASTRUCTURE","B","T+",1,66,"B",2,0.16,10,"B-","N","II",16,"A3",92,"7","B",2,"B+",3,"B+",3,"A+",1,101,8,null,34,null,30812.149999999998,278.37,0,377.57,0,0,0,0,0,0,0,0,0,0,0,0,0,0,0,31468.089999999997,28.432018918918921,1106.7835207108999]
["ENV024","ASSISTANT NURSERY OPERATIVE ","PARKS","ENVIRONMENT","ENVIRONMENT","B","T+",1,66,"B",2,0.16,10,"B-","N","II+",19,"A4",95,"7","B",2,"B",2,"B",2,"A",0,101,8,null,3,null,704.52,0,0,0,0,0,0,0,0,0,0,0,0,0,0,0,0,0,0,704.52,1.6216000000000002,434.45979279723724]
["MUL145","CASHIER","FINANCIAL PROCESSING","FINANCE & FINANCIAL MANAGEMENT","MULTIPLE","B+","I-",1,76,"B","1+",0.14000000000000001,10,"A+","N","II",14,"A2",100,"8","A+",1,"A",0,"B",2,"A",0,103,8,null,2,null,0,0,0,0,0,0,0,0,0,0,0,0,0,0,0,0,0,0,0,0,2,0]
["ENV014","GROUNDS OPERATIVE","GROUNDS","ENVIRONMENT","ENVIRONMENT","B+","T",1,66,"B",2,0.16,10,"B-","N","II",16,"A3",92,"7","C+",5,"C-",3,"B+",3,"A",0,103,8,null,92,null,50391.27,0,0,1620,354.19000000000005,0,0,0,0,0,0,0,0,0,0,0,0,0,0,52365.46,89.347155378969305,586.0898399942331]
["ENV007","HWRC OPERATIVE","SCHOOLS","ENVIRONMENT","ENVIRONMENT","B","T+",1,66,"B","1+",0.14000000000000001,9,"B-","N","II",16,"A4",91,"7","C",4,"C+",5,"B",2,"A+",1,103,8,null,8,null,571.47,1987.65,0,0,0,0,0,0,0,0,0,0,274.19999999999993,0,0,0,0,0,0,2833.3199999999997,8,354.16499999999996]
["MUL168","ADVANCED APPRENTICE - IT / TECHNICAL","APPRENTICE","APPRENTICE","MULTIPLE","C-","T+",1,76,"B",2,0.16,12,"B-","N","II",16,"A2",104,"8","A",0,"A",0,"A",0,"A",0,104,8,null,1,null,0,0,0,0,0,0,0,0,0,0,0,0,0,0,0,0,0,0,0,0,1,0]
["MUL053","TEAM SUPPORT ADMIN ASSISTANT I","SCHOOLS","BUSINESS SUPPORT & ADMINISTRATION","MULTIPLE","C-","T+",1,76,"B",2,0.16,12,"B-","N","II",16,"A2",104,"8","A",0,"A",0,"A",0,"A",0,104,8,null,4,null,300.83,0,0,0,0,0,0,0,0,0,0,0,0,0,0,0,0,0,0,300.83,4.233777988575457,71.054741370890952]
["HOU017","TRADESPERSON I","SCHOOLS","HOUSING","HOUSING","B+","T+",1,66,"B",2,0.16,10,"B-","N","II",16,"A3",92,"7","C+",5,"C",4,"C-",3,"A",0,104,8,null,1,null,1809.4,0,0,0,0,0,0,0,0,0,0,0,0,0,0,0,0,0,0,1809.4,1,1809.4]
["ENV005","CLEANSING OPERATIVE","SCHOOLS","ENVIRONMENT","ENVIRONMENT","B","T+",1,66,"B","1+",0.14000000000000001,9,"B-","N","II",16,"A4",91,"7","C+",5,"C+",5,"B",2,"A+",1,104,8,null,87,null,39889.420000000013,14336.679999999998,0,0,188.09,0,0,0,0,0,0,0,0,0,0,0,0,0,0,54414.19000000001,83.063066666666643,655.09488372690339]
["CUL014","LEISURE ASSISTANT","LEISURE","LEISURE","DESTINATION & CULTURE","B+","T+",1,66,"B",2,0.16,10,"B ","N","II",19,"A4",95,"7","B+",3,"B+",3,"B+",3,"A",0,104,8,null,6,null,4981.7900000000009,0,0,0,0,0,0,0,0,0,0,0,0,0,0,0,0,0,0,4981.7900000000009,2.6756972972972974,1861.8660657287621]
["SCH007","COVER SUPERVISOR","SCHOOLS","EDUCATION","SCHOOLS","B+","T+",2,76,"B",2,0.16,12,"B-","N","II",16,"A2",104,"8","A",0,"A",0,"A",0,"A+",1,105,8,null,0,null,0,0,0,0,0,0,0,0,0,0,0,0,0,0,0,0,0,0,0,0,2.0753895437439742,0]
{"$rows_left_out":551}